{"text_format":"1","workbook":"xlsx","n_sheets":5,"sheets":["Menu","Instrukcja","Symulacja_dane","Raport PCCP_faktura","Instruction"],"not_rendered":{"charts":0,"images":3,"macros":1,"external_links":0,"defined_names":0,"comments":0,"pivot_tables":0},"unopened":[],"bounds":{"document_bytes":16777216,"sheet_cells":100000,"rows_first":2000,"rows_last":500,"rows_between":2000,"halvings":0,"cell_chars":16384,"cell_head_chars":4096},"cells_cut":0,"cells_raw":0,"read":"whole","date_system":"1900"}

{"sheet":"Menu","index":0,"n_rows":3,"n_cols":5,"rows_kept":3,"cut":false,"hidden":false,"merged":[]}
[]
[]
[null,null,null,null,0]

{"sheet":"Instrukcja","index":1,"n_rows":0,"n_cols":0,"rows_kept":0,"cut":false,"hidden":true,"merged":[]}

{"sheet":"Symulacja_dane","index":2,"n_rows":34,"n_cols":25,"rows_kept":34,"cut":false,"hidden":true,"merged":[]}
[]
[null,null,"RDN","RDNG","RDB","RDBG","RPM","RPMEF","RTEE","RTTG","Wartość"]
[null,{"$f":"TODAY()-30","v":"2026-02-22"},null,null,null,null,null,null,null,null,null,null,null,null,null,null,null,{"$f":"TEXT($B3,\"dd.mm.rrrr \")&C$2","v":"22.02.2026 RDN"},"22.02.2026 RDNG","22.02.2026 RDB","22.02.2026 RDBG","22.02.2026 RPM","22.02.2026 RPMEF","22.02.2026 RTEE","22.02.2026 RTTG"]
[null,{"$f":"TODAY()-29","v":"2026-02-23"},{"$f":"IFERROR(VLOOKUP(R5,'Raport PCCP_faktura'!A:O,15,FALSE),0)*(-1)","v":0},{"$f":"IFERROR(VLOOKUP(S5,'Raport PCCP_faktura'!A:O,15,FALSE),0)*(-1)","v":0},{"$f":"IFERROR(VLOOKUP(T3,'Raport PCCP_faktura'!A:O,15,FALSE),0)*(-1)","v":0},{"$f":"IFERROR(VLOOKUP(U4,'Raport PCCP_faktura'!A:O,15,FALSE),0)*(-1)","v":0},{"$f":"IFERROR(VLOOKUP(V4,'Raport PCCP_faktura'!A:O,15,FALSE),0)*(-1)","v":0},{"$f":"IFERROR(VLOOKUP(W4,'Raport PCCP_faktura'!A:O,15,FALSE),0)*(-1)","v":0},{"$f":"IFERROR(VLOOKUP(X5,'Raport PCCP_faktura'!A:O,15,FALSE),0)*(-1)","v":0},{"$f":"IFERROR(VLOOKUP(Y5,'Raport PCCP_faktura'!A:O,15,FALSE),0)*(-1)","v":0},{"$f":"ROUND(SUM(C4:H4)+IF(I4+J4<0,I4+J4,0),2)","v":0},null,null,null,null,null,null,"23.02.2026 RDN","23.02.2026 RDNG","23.02.2026 RDB","23.02.2026 RDBG","23.02.2026 RPM","23.02.2026 RPMEF","23.02.2026 RTEE","23.02.2026 RTTG"]
[null,{"$f":"TODAY()-28","v":"2026-02-24"},{"$f":"IFERROR(VLOOKUP(R6,'Raport PCCP_faktura'!A:O,15,FALSE),0)*(-1)","v":0},{"$f":"IFERROR(VLOOKUP(S6,'Raport PCCP_faktura'!A:O,15,FALSE),0)*(-1)","v":0},{"$f":"IFERROR(VLOOKUP(T4,'Raport PCCP_faktura'!A:O,15,FALSE),0)*(-1)","v":0},{"$f":"IFERROR(VLOOKUP(U5,'Raport PCCP_faktura'!A:O,15,FALSE),0)*(-1)","v":0},{"$f":"IFERROR(VLOOKUP(V5,'Raport PCCP_faktura'!A:O,15,FALSE),0)*(-1)","v":0},{"$f":"IFERROR(VLOOKUP(W5,'Raport PCCP_faktura'!A:O,15,FALSE),0)*(-1)","v":0},{"$f":"IFERROR(VLOOKUP(X6,'Raport PCCP_faktura'!A:O,15,FALSE),0)*(-1)","v":0},{"$f":"IFERROR(VLOOKUP(Y6,'Raport PCCP_faktura'!A:O,15,FALSE),0)*(-1)","v":0},{"$f":"ROUND(SUM(C5:H5)+IF(I5+J5<0,I5+J5,0),2)","v":0},null,null,null,null,null,null,{"$f":"TEXT(B5,\"dd.mm.rrrr \")&$C$2","v":"24.02.2026 RDN"},{"$f":"TEXT($B5,\"dd.mm.rrrr \")&D$2","v":"24.02.2026 RDNG"},{"$f":"TEXT($B5,\"dd.mm.rrrr \")&E$2","v":"24.02.2026 RDB"},{"$f":"TEXT($B5,\"dd.mm.rrrr \")&F$2","v":"24.02.2026 RDBG"},{"$f":"TEXT($B5,\"dd.mm.rrrr \")&G$2","v":"24.02.2026 RPM"},{"$f":"TEXT($B5,\"dd.mm.rrrr \")&H$2","v":"24.02.2026 RPMEF"},{"$f":"TEXT($B5,\"dd.mm.rrrr \")&I$2","v":"24.02.2026 RTEE"},{"$f":"TEXT($B5,\"dd.mm.rrrr \")&J$2","v":"24.02.2026 RTTG"}]
[null,{"$f":"TODAY()-27","v":"2026-02-25"},{"$f":"IFERROR(VLOOKUP(R7,'Raport PCCP_faktura'!A:O,15,FALSE),0)*(-1)","v":0},{"$f":"IFERROR(VLOOKUP(S7,'Raport PCCP_faktura'!A:O,15,FALSE),0)*(-1)","v":0},{"$f":"IFERROR(VLOOKUP(T5,'Raport PCCP_faktura'!A:O,15,FALSE),0)*(-1)","v":0},{"$f":"IFERROR(VLOOKUP(U6,'Raport PCCP_faktura'!A:O,15,FALSE),0)*(-1)","v":0},{"$f":"IFERROR(VLOOKUP(V6,'Raport PCCP_faktura'!A:O,15,FALSE),0)*(-1)","v":0},{"$f":"IFERROR(VLOOKUP(W6,'Raport PCCP_faktura'!A:O,15,FALSE),0)*(-1)","v":0},{"$f":"IFERROR(VLOOKUP(X7,'Raport PCCP_faktura'!A:O,15,FALSE),0)*(-1)","v":0},{"$f":"IFERROR(VLOOKUP(Y7,'Raport PCCP_faktura'!A:O,15,FALSE),0)*(-1)","v":0},0,null,null,null,null,null,null,"25.02.2026 RDN","25.02.2026 RDNG","25.02.2026 RDB","25.02.2026 RDBG","25.02.2026 RPM","25.02.2026 RPMEF","25.02.2026 RTEE","25.02.2026 RTTG"]
[null,{"$f":"TODAY()-26","v":"2026-02-26"},{"$f":"IFERROR(VLOOKUP(R8,'Raport PCCP_faktura'!A:O,15,FALSE),0)*(-1)","v":0},{"$f":"IFERROR(VLOOKUP(S8,'Raport PCCP_faktura'!A:O,15,FALSE),0)*(-1)","v":0},{"$f":"IFERROR(VLOOKUP(T6,'Raport PCCP_faktura'!A:O,15,FALSE),0)*(-1)","v":0},{"$f":"IFERROR(VLOOKUP(U7,'Raport PCCP_faktura'!A:O,15,FALSE),0)*(-1)","v":0},{"$f":"IFERROR(VLOOKUP(V7,'Raport PCCP_faktura'!A:O,15,FALSE),0)*(-1)","v":0},{"$f":"IFERROR(VLOOKUP(W7,'Raport PCCP_faktura'!A:O,15,FALSE),0)*(-1)","v":0},{"$f":"IFERROR(VLOOKUP(X8,'Raport PCCP_faktura'!A:O,15,FALSE),0)*(-1)","v":0},{"$f":"IFERROR(VLOOKUP(Y8,'Raport PCCP_faktura'!A:O,15,FALSE),0)*(-1)","v":0},0,null,"Łączna wartość transakcji",{"$f":"MAX(K4:K33)","v":0},null,null,null,"26.02.2026 RDN","26.02.2026 RDNG","26.02.2026 RDB","26.02.2026 RDBG","26.02.2026 RPM","26.02.2026 RPMEF","26.02.2026 RTEE","26.02.2026 RTTG"]
[null,{"$f":"TODAY()-25","v":"2026-02-27"},{"$f":"IFERROR(VLOOKUP(R9,'Raport PCCP_faktura'!A:O,15,FALSE),0)*(-1)","v":0},{"$f":"IFERROR(VLOOKUP(S9,'Raport PCCP_faktura'!A:O,15,FALSE),0)*(-1)","v":0},{"$f":"IFERROR(VLOOKUP(T7,'Raport PCCP_faktura'!A:O,15,FALSE),0)*(-1)","v":0},{"$f":"IFERROR(VLOOKUP(U8,'Raport PCCP_faktura'!A:O,15,FALSE),0)*(-1)","v":0},{"$f":"IFERROR(VLOOKUP(V8,'Raport PCCP_faktura'!A:O,15,FALSE),0)*(-1)","v":0},{"$f":"IFERROR(VLOOKUP(W8,'Raport PCCP_faktura'!A:O,15,FALSE),0)*(-1)","v":0},{"$f":"IFERROR(VLOOKUP(X9,'Raport PCCP_faktura'!A:O,15,FALSE),0)*(-1)","v":0},{"$f":"IFERROR(VLOOKUP(Y9,'Raport PCCP_faktura'!A:O,15,FALSE),0)*(-1)","v":0},0,null,"Mnożnik",2.4,null,null,null,"27.02.2026 RDN","27.02.2026 RDNG","27.02.2026 RDB","27.02.2026 RDBG","27.02.2026 RPM","27.02.2026 RPMEF","27.02.2026 RTEE","27.02.2026 RTTG"]
[null,{"$f":"TODAY()-24","v":"2026-02-28"},{"$f":"IFERROR(VLOOKUP(R10,'Raport PCCP_faktura'!A:O,15,FALSE),0)*(-1)","v":0},{"$f":"IFERROR(VLOOKUP(S10,'Raport PCCP_faktura'!A:O,15,FALSE),0)*(-1)","v":0},{"$f":"IFERROR(VLOOKUP(T8,'Raport PCCP_faktura'!A:O,15,FALSE),0)*(-1)","v":0},{"$f":"IFERROR(VLOOKUP(U9,'Raport PCCP_faktura'!A:O,15,FALSE),0)*(-1)","v":0},{"$f":"IFERROR(VLOOKUP(V9,'Raport PCCP_faktura'!A:O,15,FALSE),0)*(-1)","v":0},{"$f":"IFERROR(VLOOKUP(W9,'Raport PCCP_faktura'!A:O,15,FALSE),0)*(-1)","v":0},{"$f":"IFERROR(VLOOKUP(X10,'Raport PCCP_faktura'!A:O,15,FALSE),0)*(-1)","v":0},{"$f":"IFERROR(VLOOKUP(Y10,'Raport PCCP_faktura'!A:O,15,FALSE),0)*(-1)","v":0},0,null,"Wartość Depozytu historycznego",{"$f":"ROUND(MAX(N7*N8,10000),2)","v":10000},null,null,null,"28.02.2026 RDN","28.02.2026 RDNG","28.02.2026 RDB","28.02.2026 RDBG","28.02.2026 RPM","28.02.2026 RPMEF","28.02.2026 RTEE","28.02.2026 RTTG"]
[null,{"$f":"TODAY()-23","v":"2026-03-01"},{"$f":"IFERROR(VLOOKUP(R11,'Raport PCCP_faktura'!A:O,15,FALSE),0)*(-1)","v":0},{"$f":"IFERROR(VLOOKUP(S11,'Raport PCCP_faktura'!A:O,15,FALSE),0)*(-1)","v":0},{"$f":"IFERROR(VLOOKUP(T9,'Raport PCCP_faktura'!A:O,15,FALSE),0)*(-1)","v":0},{"$f":"IFERROR(VLOOKUP(U10,'Raport PCCP_faktura'!A:O,15,FALSE),0)*(-1)","v":0},{"$f":"IFERROR(VLOOKUP(V10,'Raport PCCP_faktura'!A:O,15,FALSE),0)*(-1)","v":0},{"$f":"IFERROR(VLOOKUP(W10,'Raport PCCP_faktura'!A:O,15,FALSE),0)*(-1)","v":0},{"$f":"IFERROR(VLOOKUP(X11,'Raport PCCP_faktura'!A:O,15,FALSE),0)*(-1)","v":0},{"$f":"IFERROR(VLOOKUP(Y11,'Raport PCCP_faktura'!A:O,15,FALSE),0)*(-1)","v":0},0,null,null,null,null,null,null,"01.03.2026 RDN","01.03.2026 RDNG","01.03.2026 RDB","01.03.2026 RDBG","01.03.2026 RPM","01.03.2026 RPMEF","01.03.2026 RTEE","01.03.2026 RTTG"]
[null,{"$f":"TODAY()-22","v":"2026-03-02"},{"$f":"IFERROR(VLOOKUP(R12,'Raport PCCP_faktura'!A:O,15,FALSE),0)*(-1)","v":0},{"$f":"IFERROR(VLOOKUP(S12,'Raport PCCP_faktura'!A:O,15,FALSE),0)*(-1)","v":0},{"$f":"IFERROR(VLOOKUP(T10,'Raport PCCP_faktura'!A:O,15,FALSE),0)*(-1)","v":0},{"$f":"IFERROR(VLOOKUP(U11,'Raport PCCP_faktura'!A:O,15,FALSE),0)*(-1)","v":0},{"$f":"IFERROR(VLOOKUP(V11,'Raport PCCP_faktura'!A:O,15,FALSE),0)*(-1)","v":0},{"$f":"IFERROR(VLOOKUP(W11,'Raport PCCP_faktura'!A:O,15,FALSE),0)*(-1)","v":0},{"$f":"IFERROR(VLOOKUP(X12,'Raport PCCP_faktura'!A:O,15,FALSE),0)*(-1)","v":0},{"$f":"IFERROR(VLOOKUP(Y12,'Raport PCCP_faktura'!A:O,15,FALSE),0)*(-1)","v":0},0,null,null,null,null,null,null,"02.03.2026 RDN","02.03.2026 RDNG","02.03.2026 RDB","02.03.2026 RDBG","02.03.2026 RPM","02.03.2026 RPMEF","02.03.2026 RTEE","02.03.2026 RTTG"]
[null,{"$f":"TODAY()-21","v":"2026-03-03"},{"$f":"IFERROR(VLOOKUP(R13,'Raport PCCP_faktura'!A:O,15,FALSE),0)*(-1)","v":0},{"$f":"IFERROR(VLOOKUP(S13,'Raport PCCP_faktura'!A:O,15,FALSE),0)*(-1)","v":0},{"$f":"IFERROR(VLOOKUP(T11,'Raport PCCP_faktura'!A:O,15,FALSE),0)*(-1)","v":0},{"$f":"IFERROR(VLOOKUP(U12,'Raport PCCP_faktura'!A:O,15,FALSE),0)*(-1)","v":0},{"$f":"IFERROR(VLOOKUP(V12,'Raport PCCP_faktura'!A:O,15,FALSE),0)*(-1)","v":0},{"$f":"IFERROR(VLOOKUP(W12,'Raport PCCP_faktura'!A:O,15,FALSE),0)*(-1)","v":0},{"$f":"IFERROR(VLOOKUP(X13,'Raport PCCP_faktura'!A:O,15,FALSE),0)*(-1)","v":0},{"$f":"IFERROR(VLOOKUP(Y13,'Raport PCCP_faktura'!A:O,15,FALSE),0)*(-1)","v":0},0,null,null,null,null,null,null,"03.03.2026 RDN","03.03.2026 RDNG","03.03.2026 RDB","03.03.2026 RDBG","03.03.2026 RPM","03.03.2026 RPMEF","03.03.2026 RTEE","03.03.2026 RTTG"]
[null,{"$f":"TODAY()-20","v":"2026-03-04"},{"$f":"IFERROR(VLOOKUP(R14,'Raport PCCP_faktura'!A:O,15,FALSE),0)*(-1)","v":0},{"$f":"IFERROR(VLOOKUP(S14,'Raport PCCP_faktura'!A:O,15,FALSE),0)*(-1)","v":0},{"$f":"IFERROR(VLOOKUP(T12,'Raport PCCP_faktura'!A:O,15,FALSE),0)*(-1)","v":0},{"$f":"IFERROR(VLOOKUP(U13,'Raport PCCP_faktura'!A:O,15,FALSE),0)*(-1)","v":0},{"$f":"IFERROR(VLOOKUP(V13,'Raport PCCP_faktura'!A:O,15,FALSE),0)*(-1)","v":0},{"$f":"IFERROR(VLOOKUP(W13,'Raport PCCP_faktura'!A:O,15,FALSE),0)*(-1)","v":0},{"$f":"IFERROR(VLOOKUP(X14,'Raport PCCP_faktura'!A:O,15,FALSE),0)*(-1)","v":0},{"$f":"IFERROR(VLOOKUP(Y14,'Raport PCCP_faktura'!A:O,15,FALSE),0)*(-1)","v":0},0,null,null,null,null,null,null,"04.03.2026 RDN","04.03.2026 RDNG","04.03.2026 RDB","04.03.2026 RDBG","04.03.2026 RPM","04.03.2026 RPMEF","04.03.2026 RTEE","04.03.2026 RTTG"]
[null,{"$f":"TODAY()-19","v":"2026-03-05"},{"$f":"IFERROR(VLOOKUP(R15,'Raport PCCP_faktura'!A:O,15,FALSE),0)*(-1)","v":0},{"$f":"IFERROR(VLOOKUP(S15,'Raport PCCP_faktura'!A:O,15,FALSE),0)*(-1)","v":0},{"$f":"IFERROR(VLOOKUP(T13,'Raport PCCP_faktura'!A:O,15,FALSE),0)*(-1)","v":0},{"$f":"IFERROR(VLOOKUP(U14,'Raport PCCP_faktura'!A:O,15,FALSE),0)*(-1)","v":0},{"$f":"IFERROR(VLOOKUP(V14,'Raport PCCP_faktura'!A:O,15,FALSE),0)*(-1)","v":0},{"$f":"IFERROR(VLOOKUP(W14,'Raport PCCP_faktura'!A:O,15,FALSE),0)*(-1)","v":0},{"$f":"IFERROR(VLOOKUP(X15,'Raport PCCP_faktura'!A:O,15,FALSE),0)*(-1)","v":0},{"$f":"IFERROR(VLOOKUP(Y15,'Raport PCCP_faktura'!A:O,15,FALSE),0)*(-1)","v":0},0,null,null,null,null,null,null,"05.03.2026 RDN","05.03.2026 RDNG","05.03.2026 RDB","05.03.2026 RDBG","05.03.2026 RPM","05.03.2026 RPMEF","05.03.2026 RTEE","05.03.2026 RTTG"]
[null,{"$f":"TODAY()-18","v":"2026-03-06"},{"$f":"IFERROR(VLOOKUP(R16,'Raport PCCP_faktura'!A:O,15,FALSE),0)*(-1)","v":0},{"$f":"IFERROR(VLOOKUP(S16,'Raport PCCP_faktura'!A:O,15,FALSE),0)*(-1)","v":0},{"$f":"IFERROR(VLOOKUP(T14,'Raport PCCP_faktura'!A:O,15,FALSE),0)*(-1)","v":0},{"$f":"IFERROR(VLOOKUP(U15,'Raport PCCP_faktura'!A:O,15,FALSE),0)*(-1)","v":0},{"$f":"IFERROR(VLOOKUP(V15,'Raport PCCP_faktura'!A:O,15,FALSE),0)*(-1)","v":0},{"$f":"IFERROR(VLOOKUP(W15,'Raport PCCP_faktura'!A:O,15,FALSE),0)*(-1)","v":0},{"$f":"IFERROR(VLOOKUP(X16,'Raport PCCP_faktura'!A:O,15,FALSE),0)*(-1)","v":0},{"$f":"IFERROR(VLOOKUP(Y16,'Raport PCCP_faktura'!A:O,15,FALSE),0)*(-1)","v":0},0,null,null,null,null,null,null,"06.03.2026 RDN","06.03.2026 RDNG","06.03.2026 RDB","06.03.2026 RDBG","06.03.2026 RPM","06.03.2026 RPMEF","06.03.2026 RTEE","06.03.2026 RTTG"]
[null,{"$f":"TODAY()-17","v":"2026-03-07"},{"$f":"IFERROR(VLOOKUP(R17,'Raport PCCP_faktura'!A:O,15,FALSE),0)*(-1)","v":0},{"$f":"IFERROR(VLOOKUP(S17,'Raport PCCP_faktura'!A:O,15,FALSE),0)*(-1)","v":0},{"$f":"IFERROR(VLOOKUP(T15,'Raport PCCP_faktura'!A:O,15,FALSE),0)*(-1)","v":0},{"$f":"IFERROR(VLOOKUP(U16,'Raport PCCP_faktura'!A:O,15,FALSE),0)*(-1)","v":0},{"$f":"IFERROR(VLOOKUP(V16,'Raport PCCP_faktura'!A:O,15,FALSE),0)*(-1)","v":0},{"$f":"IFERROR(VLOOKUP(W16,'Raport PCCP_faktura'!A:O,15,FALSE),0)*(-1)","v":0},{"$f":"IFERROR(VLOOKUP(X17,'Raport PCCP_faktura'!A:O,15,FALSE),0)*(-1)","v":0},{"$f":"IFERROR(VLOOKUP(Y17,'Raport PCCP_faktura'!A:O,15,FALSE),0)*(-1)","v":0},0,null,null,null,null,null,null,"07.03.2026 RDN","07.03.2026 RDNG","07.03.2026 RDB","07.03.2026 RDBG","07.03.2026 RPM","07.03.2026 RPMEF","07.03.2026 RTEE","07.03.2026 RTTG"]
[null,{"$f":"TODAY()-16","v":"2026-03-08"},{"$f":"IFERROR(VLOOKUP(R18,'Raport PCCP_faktura'!A:O,15,FALSE),0)*(-1)","v":0},{"$f":"IFERROR(VLOOKUP(S18,'Raport PCCP_faktura'!A:O,15,FALSE),0)*(-1)","v":0},{"$f":"IFERROR(VLOOKUP(T16,'Raport PCCP_faktura'!A:O,15,FALSE),0)*(-1)","v":0},{"$f":"IFERROR(VLOOKUP(U17,'Raport PCCP_faktura'!A:O,15,FALSE),0)*(-1)","v":0},{"$f":"IFERROR(VLOOKUP(V17,'Raport PCCP_faktura'!A:O,15,FALSE),0)*(-1)","v":0},{"$f":"IFERROR(VLOOKUP(W17,'Raport PCCP_faktura'!A:O,15,FALSE),0)*(-1)","v":0},{"$f":"IFERROR(VLOOKUP(X18,'Raport PCCP_faktura'!A:O,15,FALSE),0)*(-1)","v":0},{"$f":"IFERROR(VLOOKUP(Y18,'Raport PCCP_faktura'!A:O,15,FALSE),0)*(-1)","v":0},0,null,null,null,null,null,null,"08.03.2026 RDN","08.03.2026 RDNG","08.03.2026 RDB","08.03.2026 RDBG","08.03.2026 RPM","08.03.2026 RPMEF","08.03.2026 RTEE","08.03.2026 RTTG"]
[null,{"$f":"TODAY()-15","v":"2026-03-09"},{"$f":"IFERROR(VLOOKUP(R19,'Raport PCCP_faktura'!A:O,15,FALSE),0)*(-1)","v":0},{"$f":"IFERROR(VLOOKUP(S19,'Raport PCCP_faktura'!A:O,15,FALSE),0)*(-1)","v":0},{"$f":"IFERROR(VLOOKUP(T17,'Raport PCCP_faktura'!A:O,15,FALSE),0)*(-1)","v":0},{"$f":"IFERROR(VLOOKUP(U18,'Raport PCCP_faktura'!A:O,15,FALSE),0)*(-1)","v":0},{"$f":"IFERROR(VLOOKUP(V18,'Raport PCCP_faktura'!A:O,15,FALSE),0)*(-1)","v":0},{"$f":"IFERROR(VLOOKUP(W18,'Raport PCCP_faktura'!A:O,15,FALSE),0)*(-1)","v":0},{"$f":"IFERROR(VLOOKUP(X19,'Raport PCCP_faktura'!A:O,15,FALSE),0)*(-1)","v":0},{"$f":"IFERROR(VLOOKUP(Y19,'Raport PCCP_faktura'!A:O,15,FALSE),0)*(-1)","v":0},0,null,null,null,null,null,null,"09.03.2026 RDN","09.03.2026 RDNG","09.03.2026 RDB","09.03.2026 RDBG","09.03.2026 RPM","09.03.2026 RPMEF","09.03.2026 RTEE","09.03.2026 RTTG"]
[null,{"$f":"TODAY()-14","v":"2026-03-10"},{"$f":"IFERROR(VLOOKUP(R20,'Raport PCCP_faktura'!A:O,15,FALSE),0)*(-1)","v":0},{"$f":"IFERROR(VLOOKUP(S20,'Raport PCCP_faktura'!A:O,15,FALSE),0)*(-1)","v":0},{"$f":"IFERROR(VLOOKUP(T18,'Raport PCCP_faktura'!A:O,15,FALSE),0)*(-1)","v":0},{"$f":"IFERROR(VLOOKUP(U19,'Raport PCCP_faktura'!A:O,15,FALSE),0)*(-1)","v":0},{"$f":"IFERROR(VLOOKUP(V19,'Raport PCCP_faktura'!A:O,15,FALSE),0)*(-1)","v":0},{"$f":"IFERROR(VLOOKUP(W19,'Raport PCCP_faktura'!A:O,15,FALSE),0)*(-1)","v":0},{"$f":"IFERROR(VLOOKUP(X20,'Raport PCCP_faktura'!A:O,15,FALSE),0)*(-1)","v":0},{"$f":"IFERROR(VLOOKUP(Y20,'Raport PCCP_faktura'!A:O,15,FALSE),0)*(-1)","v":0},0,null,null,null,null,null,null,"10.03.2026 RDN","10.03.2026 RDNG","10.03.2026 RDB","10.03.2026 RDBG","10.03.2026 RPM","10.03.2026 RPMEF","10.03.2026 RTEE","10.03.2026 RTTG"]
[null,{"$f":"TODAY()-13","v":"2026-03-11"},{"$f":"IFERROR(VLOOKUP(R21,'Raport PCCP_faktura'!A:O,15,FALSE),0)*(-1)","v":0},{"$f":"IFERROR(VLOOKUP(S21,'Raport PCCP_faktura'!A:O,15,FALSE),0)*(-1)","v":0},{"$f":"IFERROR(VLOOKUP(T19,'Raport PCCP_faktura'!A:O,15,FALSE),0)*(-1)","v":0},{"$f":"IFERROR(VLOOKUP(U20,'Raport PCCP_faktura'!A:O,15,FALSE),0)*(-1)","v":0},{"$f":"IFERROR(VLOOKUP(V20,'Raport PCCP_faktura'!A:O,15,FALSE),0)*(-1)","v":0},{"$f":"IFERROR(VLOOKUP(W20,'Raport PCCP_faktura'!A:O,15,FALSE),0)*(-1)","v":0},{"$f":"IFERROR(VLOOKUP(X21,'Raport PCCP_faktura'!A:O,15,FALSE),0)*(-1)","v":0},{"$f":"IFERROR(VLOOKUP(Y21,'Raport PCCP_faktura'!A:O,15,FALSE),0)*(-1)","v":0},0,null,null,null,null,null,null,"11.03.2026 RDN","11.03.2026 RDNG","11.03.2026 RDB","11.03.2026 RDBG","11.03.2026 RPM","11.03.2026 RPMEF","11.03.2026 RTEE","11.03.2026 RTTG"]
[null,{"$f":"TODAY()-12","v":"2026-03-12"},{"$f":"IFERROR(VLOOKUP(R22,'Raport PCCP_faktura'!A:O,15,FALSE),0)*(-1)","v":0},{"$f":"IFERROR(VLOOKUP(S22,'Raport PCCP_faktura'!A:O,15,FALSE),0)*(-1)","v":0},{"$f":"IFERROR(VLOOKUP(T20,'Raport PCCP_faktura'!A:O,15,FALSE),0)*(-1)","v":0},{"$f":"IFERROR(VLOOKUP(U21,'Raport PCCP_faktura'!A:O,15,FALSE),0)*(-1)","v":0},{"$f":"IFERROR(VLOOKUP(V21,'Raport PCCP_faktura'!A:O,15,FALSE),0)*(-1)","v":0},{"$f":"IFERROR(VLOOKUP(W21,'Raport PCCP_faktura'!A:O,15,FALSE),0)*(-1)","v":0},{"$f":"IFERROR(VLOOKUP(X22,'Raport PCCP_faktura'!A:O,15,FALSE),0)*(-1)","v":0},{"$f":"IFERROR(VLOOKUP(Y22,'Raport PCCP_faktura'!A:O,15,FALSE),0)*(-1)","v":0},0,null,null,null,null,null,null,"12.03.2026 RDN","12.03.2026 RDNG","12.03.2026 RDB","12.03.2026 RDBG","12.03.2026 RPM","12.03.2026 RPMEF","12.03.2026 RTEE","12.03.2026 RTTG"]
[null,{"$f":"TODAY()-11","v":"2026-03-13"},{"$f":"IFERROR(VLOOKUP(R23,'Raport PCCP_faktura'!A:O,15,FALSE),0)*(-1)","v":0},{"$f":"IFERROR(VLOOKUP(S23,'Raport PCCP_faktura'!A:O,15,FALSE),0)*(-1)","v":0},{"$f":"IFERROR(VLOOKUP(T21,'Raport PCCP_faktura'!A:O,15,FALSE),0)*(-1)","v":0},{"$f":"IFERROR(VLOOKUP(U22,'Raport PCCP_faktura'!A:O,15,FALSE),0)*(-1)","v":0},{"$f":"IFERROR(VLOOKUP(V22,'Raport PCCP_faktura'!A:O,15,FALSE),0)*(-1)","v":0},{"$f":"IFERROR(VLOOKUP(W22,'Raport PCCP_faktura'!A:O,15,FALSE),0)*(-1)","v":0},{"$f":"IFERROR(VLOOKUP(X23,'Raport PCCP_faktura'!A:O,15,FALSE),0)*(-1)","v":0},{"$f":"IFERROR(VLOOKUP(Y23,'Raport PCCP_faktura'!A:O,15,FALSE),0)*(-1)","v":0},0,null,null,null,null,null,null,"13.03.2026 RDN","13.03.2026 RDNG","13.03.2026 RDB","13.03.2026 RDBG","13.03.2026 RPM","13.03.2026 RPMEF","13.03.2026 RTEE","13.03.2026 RTTG"]
[null,{"$f":"TODAY()-10","v":"2026-03-14"},{"$f":"IFERROR(VLOOKUP(R24,'Raport PCCP_faktura'!A:O,15,FALSE),0)*(-1)","v":0},{"$f":"IFERROR(VLOOKUP(S24,'Raport PCCP_faktura'!A:O,15,FALSE),0)*(-1)","v":0},{"$f":"IFERROR(VLOOKUP(T22,'Raport PCCP_faktura'!A:O,15,FALSE),0)*(-1)","v":0},{"$f":"IFERROR(VLOOKUP(U23,'Raport PCCP_faktura'!A:O,15,FALSE),0)*(-1)","v":0},{"$f":"IFERROR(VLOOKUP(V23,'Raport PCCP_faktura'!A:O,15,FALSE),0)*(-1)","v":0},{"$f":"IFERROR(VLOOKUP(W23,'Raport PCCP_faktura'!A:O,15,FALSE),0)*(-1)","v":0},{"$f":"IFERROR(VLOOKUP(X24,'Raport PCCP_faktura'!A:O,15,FALSE),0)*(-1)","v":0},{"$f":"IFERROR(VLOOKUP(Y24,'Raport PCCP_faktura'!A:O,15,FALSE),0)*(-1)","v":0},0,null,null,null,null,null,null,"14.03.2026 RDN","14.03.2026 RDNG","14.03.2026 RDB","14.03.2026 RDBG","14.03.2026 RPM","14.03.2026 RPMEF","14.03.2026 RTEE","14.03.2026 RTTG"]
[null,{"$f":"TODAY()-9","v":"2026-03-15"},{"$f":"IFERROR(VLOOKUP(R25,'Raport PCCP_faktura'!A:O,15,FALSE),0)*(-1)","v":0},{"$f":"IFERROR(VLOOKUP(S25,'Raport PCCP_faktura'!A:O,15,FALSE),0)*(-1)","v":0},{"$f":"IFERROR(VLOOKUP(T23,'Raport PCCP_faktura'!A:O,15,FALSE),0)*(-1)","v":0},{"$f":"IFERROR(VLOOKUP(U24,'Raport PCCP_faktura'!A:O,15,FALSE),0)*(-1)","v":0},{"$f":"IFERROR(VLOOKUP(V24,'Raport PCCP_faktura'!A:O,15,FALSE),0)*(-1)","v":0},{"$f":"IFERROR(VLOOKUP(W24,'Raport PCCP_faktura'!A:O,15,FALSE),0)*(-1)","v":0},{"$f":"IFERROR(VLOOKUP(X25,'Raport PCCP_faktura'!A:O,15,FALSE),0)*(-1)","v":0},{"$f":"IFERROR(VLOOKUP(Y25,'Raport PCCP_faktura'!A:O,15,FALSE),0)*(-1)","v":0},0,null,null,null,null,null,null,"15.03.2026 RDN","15.03.2026 RDNG","15.03.2026 RDB","15.03.2026 RDBG","15.03.2026 RPM","15.03.2026 RPMEF","15.03.2026 RTEE","15.03.2026 RTTG"]
[null,{"$f":"TODAY()-8","v":"2026-03-16"},{"$f":"IFERROR(VLOOKUP(R26,'Raport PCCP_faktura'!A:O,15,FALSE),0)*(-1)","v":0},{"$f":"IFERROR(VLOOKUP(S26,'Raport PCCP_faktura'!A:O,15,FALSE),0)*(-1)","v":0},{"$f":"IFERROR(VLOOKUP(T24,'Raport PCCP_faktura'!A:O,15,FALSE),0)*(-1)","v":0},{"$f":"IFERROR(VLOOKUP(U25,'Raport PCCP_faktura'!A:O,15,FALSE),0)*(-1)","v":0},{"$f":"IFERROR(VLOOKUP(V25,'Raport PCCP_faktura'!A:O,15,FALSE),0)*(-1)","v":0},{"$f":"IFERROR(VLOOKUP(W25,'Raport PCCP_faktura'!A:O,15,FALSE),0)*(-1)","v":0},{"$f":"IFERROR(VLOOKUP(X26,'Raport PCCP_faktura'!A:O,15,FALSE),0)*(-1)","v":0},{"$f":"IFERROR(VLOOKUP(Y26,'Raport PCCP_faktura'!A:O,15,FALSE),0)*(-1)","v":0},0,null,null,null,null,null,null,"16.03.2026 RDN","16.03.2026 RDNG","16.03.2026 RDB","16.03.2026 RDBG","16.03.2026 RPM","16.03.2026 RPMEF","16.03.2026 RTEE","16.03.2026 RTTG"]
[null,{"$f":"TODAY()-7","v":"2026-03-17"},{"$f":"IFERROR(VLOOKUP(R27,'Raport PCCP_faktura'!A:O,15,FALSE),0)*(-1)","v":0},{"$f":"IFERROR(VLOOKUP(S27,'Raport PCCP_faktura'!A:O,15,FALSE),0)*(-1)","v":0},{"$f":"IFERROR(VLOOKUP(T25,'Raport PCCP_faktura'!A:O,15,FALSE),0)*(-1)","v":0},{"$f":"IFERROR(VLOOKUP(U26,'Raport PCCP_faktura'!A:O,15,FALSE),0)*(-1)","v":0},{"$f":"IFERROR(VLOOKUP(V26,'Raport PCCP_faktura'!A:O,15,FALSE),0)*(-1)","v":0},{"$f":"IFERROR(VLOOKUP(W26,'Raport PCCP_faktura'!A:O,15,FALSE),0)*(-1)","v":0},{"$f":"IFERROR(VLOOKUP(X27,'Raport PCCP_faktura'!A:O,15,FALSE),0)*(-1)","v":0},{"$f":"IFERROR(VLOOKUP(Y27,'Raport PCCP_faktura'!A:O,15,FALSE),0)*(-1)","v":0},0,null,null,null,null,null,null,"17.03.2026 RDN","17.03.2026 RDNG","17.03.2026 RDB","17.03.2026 RDBG","17.03.2026 RPM","17.03.2026 RPMEF","17.03.2026 RTEE","17.03.2026 RTTG"]
[null,{"$f":"TODAY()-6","v":"2026-03-18"},{"$f":"IFERROR(VLOOKUP(R28,'Raport PCCP_faktura'!A:O,15,FALSE),0)*(-1)","v":0},{"$f":"IFERROR(VLOOKUP(S28,'Raport PCCP_faktura'!A:O,15,FALSE),0)*(-1)","v":0},{"$f":"IFERROR(VLOOKUP(T26,'Raport PCCP_faktura'!A:O,15,FALSE),0)*(-1)","v":0},{"$f":"IFERROR(VLOOKUP(U27,'Raport PCCP_faktura'!A:O,15,FALSE),0)*(-1)","v":0},{"$f":"IFERROR(VLOOKUP(V27,'Raport PCCP_faktura'!A:O,15,FALSE),0)*(-1)","v":0},{"$f":"IFERROR(VLOOKUP(W27,'Raport PCCP_faktura'!A:O,15,FALSE),0)*(-1)","v":0},{"$f":"IFERROR(VLOOKUP(X28,'Raport PCCP_faktura'!A:O,15,FALSE),0)*(-1)","v":0},{"$f":"IFERROR(VLOOKUP(Y28,'Raport PCCP_faktura'!A:O,15,FALSE),0)*(-1)","v":0},0,null,null,null,null,null,null,"18.03.2026 RDN","18.03.2026 RDNG","18.03.2026 RDB","18.03.2026 RDBG","18.03.2026 RPM","18.03.2026 RPMEF","18.03.2026 RTEE","18.03.2026 RTTG"]
[null,{"$f":"TODAY()-5","v":"2026-03-19"},{"$f":"IFERROR(VLOOKUP(R29,'Raport PCCP_faktura'!A:O,15,FALSE),0)*(-1)","v":0},{"$f":"IFERROR(VLOOKUP(S29,'Raport PCCP_faktura'!A:O,15,FALSE),0)*(-1)","v":0},{"$f":"IFERROR(VLOOKUP(T27,'Raport PCCP_faktura'!A:O,15,FALSE),0)*(-1)","v":0},{"$f":"IFERROR(VLOOKUP(U28,'Raport PCCP_faktura'!A:O,15,FALSE),0)*(-1)","v":0},{"$f":"IFERROR(VLOOKUP(V28,'Raport PCCP_faktura'!A:O,15,FALSE),0)*(-1)","v":0},{"$f":"IFERROR(VLOOKUP(W28,'Raport PCCP_faktura'!A:O,15,FALSE),0)*(-1)","v":0},{"$f":"IFERROR(VLOOKUP(X29,'Raport PCCP_faktura'!A:O,15,FALSE),0)*(-1)","v":0},{"$f":"IFERROR(VLOOKUP(Y29,'Raport PCCP_faktura'!A:O,15,FALSE),0)*(-1)","v":0},0,null,null,null,null,null,null,"19.03.2026 RDN","19.03.2026 RDNG","19.03.2026 RDB","19.03.2026 RDBG","19.03.2026 RPM","19.03.2026 RPMEF","19.03.2026 RTEE","19.03.2026 RTTG"]
[null,{"$f":"TODAY()-4","v":"2026-03-20"},{"$f":"IFERROR(VLOOKUP(R30,'Raport PCCP_faktura'!A:O,15,FALSE),0)*(-1)","v":0},{"$f":"IFERROR(VLOOKUP(S30,'Raport PCCP_faktura'!A:O,15,FALSE),0)*(-1)","v":0},{"$f":"IFERROR(VLOOKUP(T28,'Raport PCCP_faktura'!A:O,15,FALSE),0)*(-1)","v":0},{"$f":"IFERROR(VLOOKUP(U29,'Raport PCCP_faktura'!A:O,15,FALSE),0)*(-1)","v":0},{"$f":"IFERROR(VLOOKUP(V29,'Raport PCCP_faktura'!A:O,15,FALSE),0)*(-1)","v":0},{"$f":"IFERROR(VLOOKUP(W29,'Raport PCCP_faktura'!A:O,15,FALSE),0)*(-1)","v":0},{"$f":"IFERROR(VLOOKUP(X30,'Raport PCCP_faktura'!A:O,15,FALSE),0)*(-1)","v":0},{"$f":"IFERROR(VLOOKUP(Y30,'Raport PCCP_faktura'!A:O,15,FALSE),0)*(-1)","v":0},0,null,null,null,null,null,null,"20.03.2026 RDN","20.03.2026 RDNG","20.03.2026 RDB","20.03.2026 RDBG","20.03.2026 RPM","20.03.2026 RPMEF","20.03.2026 RTEE","20.03.2026 RTTG"]
[null,{"$f":"TODAY()-3","v":"2026-03-21"},{"$f":"IFERROR(VLOOKUP(R31,'Raport PCCP_faktura'!A:O,15,FALSE),0)*(-1)","v":0},{"$f":"IFERROR(VLOOKUP(S31,'Raport PCCP_faktura'!A:O,15,FALSE),0)*(-1)","v":0},{"$f":"IFERROR(VLOOKUP(T29,'Raport PCCP_faktura'!A:O,15,FALSE),0)*(-1)","v":0},{"$f":"IFERROR(VLOOKUP(U30,'Raport PCCP_faktura'!A:O,15,FALSE),0)*(-1)","v":0},{"$f":"IFERROR(VLOOKUP(V30,'Raport PCCP_faktura'!A:O,15,FALSE),0)*(-1)","v":0},{"$f":"IFERROR(VLOOKUP(W30,'Raport PCCP_faktura'!A:O,15,FALSE),0)*(-1)","v":0},{"$f":"IFERROR(VLOOKUP(X31,'Raport PCCP_faktura'!A:O,15,FALSE),0)*(-1)","v":0},{"$f":"IFERROR(VLOOKUP(Y31,'Raport PCCP_faktura'!A:O,15,FALSE),0)*(-1)","v":0},0,null,null,null,null,null,null,"21.03.2026 RDN","21.03.2026 RDNG","21.03.2026 RDB","21.03.2026 RDBG","21.03.2026 RPM","21.03.2026 RPMEF","21.03.2026 RTEE","21.03.2026 RTTG"]
{"$rows_left_out":5}
{"sheet":"Raport PCCP_faktura","index":3,"n_rows":1400,"n_cols":1,"rows_kept":1400,"cut":false,"hidden":true,"merged":[]}
[]
[]
[]
[]
[]
[]
[]
[]
[]
[]
[]
[]
[{"$f":"TEXT(F13,\"dd.mm.rrrr\")&\" \"&I13","v":"00.01.1900 "}]
[{"$f":"TEXT(F14,\"dd.mm.rrrr\")&\" \"&I14","v":"00.01.1900 "}]
["00.01.1900 "]
["00.01.1900 "]
["00.01.1900 "]
["00.01.1900 "]
["00.01.1900 "]
["00.01.1900 "]
["00.01.1900 "]
["00.01.1900 "]
["00.01.1900 "]
["00.01.1900 "]
["00.01.1900 "]
["00.01.1900 "]
["00.01.1900 "]
["00.01.1900 "]
["00.01.1900 "]
["00.01.1900 "]
{"$rows_left_out":1371}
{"sheet":"Instruction","index":4,"n_rows":0,"n_cols":0,"rows_kept":0,"cut":false,"hidden":true,"merged":[]}